{"text_format":"1","workbook":"xlsx","n_sheets":25,"sheets":["Scrum Summary","DataSummary","Instructions","Sprint-Prepare","Sprint 1-Sprint N","Sprint-Z Hardening","Consulting Services","Sprint-Prepare Task Details","CaseFeature Details","ReportsCorr","Interfaces","CDH","Sprint-Z Hardening Details","CTB Import","EZ Sizer Import","Scaling","Resource Planning","StaffingPlanExport","Rapid Delivery Planning","Calculations Page","DropDowns","Work Effort","DataExtract","EZS Data","ResourceAndOther"],"not_rendered":{"charts":3,"images":16,"macros":1,"external_links":0,"defined_names":137,"comments":0,"pivot_tables":0},"unopened":[],"bounds":{"document_bytes":16777216,"sheet_cells":100000,"rows_first":2000,"rows_last":500,"rows_between":2000,"halvings":0,"cell_chars":16384,"cell_head_chars":4096},"cells_cut":0,"cells_raw":0,"read":"whole","date_system":"1900"}

{"sheet":"Scrum Summary","index":0,"n_rows":27,"n_cols":17,"rows_kept":27,"cut":false,"hidden":false,"merged":[[13,0,13,1],[8,6,8,7],[9,6,9,7],[10,6,10,7],[10,0,10,1],[10,4,10,5],[5,0,5,1],[5,4,5,5],[8,4,8,5],[9,4,9,5],[6,2,6,3],[8,0,8,1],[6,4,6,5],[6,6,6,7],[1,4,1,5],[0,0,0,18],[4,0,4,1],[7,0,7,1],[4,4,4,5],[6,0,6,1],[5,2,5,3],[7,2,7,3],[4,2,4,3],[1,0,1,1],[1,2,1,3],[1,6,1,7],[7,4,7,5],[1,8,1,18],[5,6,5,7],[3,0,3,7],[4,6,4,7],[7,6,7,7],[24,6,24,7],[26,0,26,9],[14,0,14,1],[15,0,15,1],[16,0,16,1],[10,2,10,3],[19,0,19,7],[13,6,13,7],[12,0,12,7],[20,0,20,1],[9,0,9,1],[8,2,8,3],[9,2,9,3],[26,10,26,18],[22,0,22,1],[23,0,23,1],[24,0,24,1],[21,0,21,1]]}
["PEGASYSTEMS SCRUM PROJECT EFFORT MODELING TOOL"]
["Sizing Tool Release Date:",null,"2021-05-13",null,"Sizing Tool Version:",null,"SCRUM V 24",null,{"$f":"\"© \" & YEAR(C2) &\" Pegasystems, Inc. All rights reserved.\"","v":"© 2021 Pegasystems, Inc. All rights reserved."}]
[]
["PROJECT SIZING SUMMARY"]
["*CLIENT NAME:",null,null,null,"* Engagement NAME:",null,null,null,null,null,null,null,null,null,{"$f":"D21","v":"Sprint-Initiate"},"Sprint 1-N","Sprint-Z Hardening"]
[null,null,null,null,"Multi-Release Schedule:",null,"N",null,null,null,null,null,null,"Pega Resource Hours:",480,520,360]
{"$rows_left_out":22}
{"sheet":"DataSummary","index":1,"n_rows":41,"n_cols":3,"rows_kept":41,"cut":false,"hidden":true,"merged":[]}
["Name","Value ","Units"]
["Sizing Type","Scrum"]
["Project Type",{"$f":"'Scrum Summary'!C6","v":0}]
["Initiate/Sprint- Duration",{"$f":"'Scrum Summary'!G15","v":2},"Weeks"]
["Iteration/Sprint Duration",{"$f":"'Scrum Summary'!F16","v":1}]
["Num of Iterations/Sprints",{"$f":"'Scrum Summary'!$E$16","v":2},"Weeks"]
{"$rows_left_out":36}
{"sheet":"Instructions","index":2,"n_rows":12,"n_cols":2,"rows_kept":12,"cut":false,"hidden":false,"merged":[]}
["Tab Name","Help Text"]
[{"$f":"MID(CELL(\"filename\",'Scrum Summary'!A1),FIND(\"]\",CELL(\"filename\",'Scrum Summary'!A1))+1,255)","v":"Scrum Summary"},"In the “Project Sizing Summary” section, enter high-level details about your project. \n\nAll other sections, graphs, and timelines in this worksheet update in real time as you provide values in the cells of other worksheets in the tool."]
[{"$f":"MID(CELL(\"filename\",'Sprint-Prepare Task Details'!A1),FIND(\"]\",CELL(\"filename\",'Sprint-Prepare Task Details'!A1))+1,255)","v":"Sprint-Prepare Task Details"},"Default \"Best Practice\" tasks have been listed. These tasks assume activities the team must accomplish before they can begin development. Typical initialization tasks include: getting access to repositories, allocating hardware, or installing software. \nAction: Adjust the estimated effort in \"Column G\". "]
[{"$f":"MID(CELL(\"filename\",'CaseFeature Details'!A1),FIND(\"]\",CELL(\"filename\",'CaseFeature Details'!A1))+1,255)","v":"CaseFeature Details"},"Features are the key components or functionality of the Applications  whose development work can be described by one or many Epics or User Stories\nCase Type represent business work in your application that follows a life cycle, or path, to completion. For example, “Handle Claim” or “Raise Complaint”.\nAction: List the inheriant case types features for your application, then Collaborate with stakeholders to capture what your application does in specifications or stories. You can adjust the estimated hours for an item by providing a positive or negative delta in hours. \nBy default, specifications are created for the specifications and locally created stories that exist in your application."]
[{"$f":"MID(CELL(\"filename\",ReportsCorr!A1),FIND(\"]\",CELL(\"filename\",ReportsCorr!A1))+1,255)","v":"ReportsCorr"},"Action: List the Application OOTB Reports as needed. Collaborate with stakeholders to capture how your application reports information in specifications and stories. You can adjust the estimated hours for an item by providing a positive or negative delta in hours."]
[{"$f":"MID(CELL(\"filename\",Interfaces!A1),FIND(\"]\",CELL(\"filename\",Interfaces!A1))+1,255)","v":"Interfaces"},"Action: Include all known interfaces and services known. Collaborate with stakeholders to capture the integration points for your application in specifications and stories. You can adjust the estimated hours for an item by providing a positive or negative delta in hours."]
{"$rows_left_out":7}
{"sheet":"Sprint-Prepare","index":3,"n_rows":31,"n_cols":17,"rows_kept":31,"cut":false,"hidden":false,"merged":[[25,0,25,5],[4,12,4,13],[5,0,5,2],[6,0,6,2],[6,5,6,9],[7,0,7,2],[7,5,7,9],[5,10,5,11],[6,10,6,11],[4,10,4,11],[5,12,5,15],[9,0,9,4],[9,5,9,9],[2,0,2,1],[2,2,2,11],[30,6,30,14],[0,0,0,11],[28,0,28,1],[26,0,27,1],[26,2,27,2],[26,3,26,4],[26,5,27,5],[3,10,3,11],[5,5,5,9],[3,0,3,2],[3,5,3,9],[4,0,4,2],[4,5,4,9],[29,0,29,1]]}
["SPRINT-INITIATE RESOURCE PLANNING"]
[]
["PEGA SCRUM",null,{"$f":"IF(F31>I24, \"WARNING! - Work effort is greater than productive capacity.  Please adjust resource model accordingly.\", \"\")","v":""}]
["Sprint- Initiate Length:",null,null,2,"Weeks","Estimated Sprint-Initiate Start Date:",null,null,null,null,"2021-02-22"]
["Workdays within Sprint - Initiate:",null,null,{"$f":"5*Sprint0Len","v":10},"Days","Estimated Sprint-Initiate End Date:",null,null,null,null,{"$f":"IF(LEN(K4)<1,\"\",WORKDAY(K4,(D4*5)-1))","v":"2021-03-05"}]
["Billable Hours/Work Day",null,null,8,"Hours",null,null,null,null,null,null,null,"# Resources to add",null,null,null,4]
{"$rows_left_out":26}
{"sheet":"Sprint 1-Sprint N","index":4,"n_rows":55,"n_cols":21,"rows_kept":55,"cut":false,"hidden":false,"merged":[[25,8,25,10],[37,0,37,5],[38,0,38,5],[28,2,29,2],[28,3,29,3],[27,0,27,7],[28,7,29,7],[28,5,28,6],[28,4,29,4],[34,0,34,1],[35,0,35,1],[34,7,35,7],[54,0,54,1],[40,0,40,6],[42,0,42,1],[43,0,43,1],[44,0,44,1],[51,0,51,1],[53,0,53,1],[52,0,52,1],[41,0,41,1],[45,0,45,1],[46,0,46,1],[47,0,47,1],[48,0,48,1],[49,0,49,1],[50,0,50,1],[3,0,3,2],[3,10,3,11],[5,5,5,9],[0,0,0,11],[4,10,4,11],[3,5,3,9],[4,0,4,2],[4,5,4,9],[5,0,5,2],[2,0,2,1],[2,2,2,11],[4,12,4,13],[5,12,5,13],[33,0,33,1],[7,5,7,9],[6,5,6,9],[6,0,6,2],[7,0,7,2],[32,0,32,1],[30,0,30,1],[31,0,31,1],[28,0,29,1],[9,0,9,4],[9,5,9,11],[24,3,25,3],[24,5,25,5],[24,11,25,11]]}
["SPRINT 1 - SPRINT N RESOURCE PLANNING"]
[]
["PEGA SCRUM",null,{"$f":"IF(OR(C36>ROUNDUP(I25,0)*$K$6,D36>ROUNDUP(J25,0)*$K$6,E36>ROUNDUP(K25,0)*$K$6), \"WARNING! - Work effort is greater than productive capacity.  Please adjust resource model accordingly.\", \"\")","v":""}]
["Single Sprint Length:",null,null,2,"Weeks","Estimated First Sprint Start Date:",null,null,null,null,{"$f":"IFERROR(WORKDAY('Sprint-Prepare'!K5, 1),\"\")","v":"2021-03-08"}]
["Workdays within Single Sprint:",null,null,{"$f":"Sprint1NLen*5","v":10},"Days","Estimated Last Sprint End Date:",null,null,null,null,{"$f":"IF(LEN(K4)<1,\"\",WORKDAY(K4,(D4*NumSprints*5)-1))","v":"2021-03-19"}]
["Billable Hours/Work Day",null,null,8,"Hours","Estimated Num of Sprints:",null,null,null,null,{"$f":"MAX(ROUNDUP(IF(RDFlag=\"Y\", U55, MAX(IFERROR(H35/I26,0),1)),0),1)","v":1},"Sprints","# Resources to add",null,0]
{"$rows_left_out":50}
{"sheet":"Sprint-Z Hardening","index":5,"n_rows":31,"n_cols":15,"rows_kept":31,"cut":false,"hidden":false,"merged":[[4,12,4,13],[5,0,5,2],[5,10,5,11],[5,12,5,13],[6,0,6,2],[6,5,6,9],[6,10,6,11],[4,0,4,2],[4,5,4,9],[4,10,4,11],[9,5,9,10],[9,0,9,4],[0,0,0,11],[7,0,7,2],[7,5,7,9],[3,0,3,2],[3,5,3,9],[3,10,3,11],[2,0,2,1],[2,2,2,11],[27,0,27,1],[29,0,29,1],[28,0,28,1],[24,0,24,5],[25,0,26,1],[25,2,26,2],[25,3,25,4],[25,5,26,5]]}
["SPRINT-Z HARDENING RESOURCE PLANNING"]
[]
["PEGA SCRUM",null,{"$f":"IF(F31>I23, \"WARNING! - Work effort is greater than productive capacity.  Please adjust resource model accordingly.\", \"\")","v":""}]
["Sprint-Z Length:",null,null,2,"Weeks","Estimated Sprint-Z Start Date:",null,null,null,null,{"$f":"IFERROR(WORKDAY('Sprint 1-Sprint N'!K5, 1),\"\")","v":"2021-03-22"}]
["Workdays within Sprint - Z:",null,null,{"$f":"SprintZLen*5","v":10},"Days","Estimated Sprint-Z End Date:",null,null,null,null,{"$f":"IFERROR(IF(WORKDAY(K4,D5-1)<K4,K4,WORKDAY(K4,D5-1)),\"\")","v":"2021-04-02"}]
["Billable Hours/Work Day",null,null,8,"Hours",null,null,null,null,null,null,null,"# Resources to add",null,1]
{"$rows_left_out":26}
{"sheet":"Consulting Services","index":6,"n_rows":15,"n_cols":10,"rows_kept":15,"cut":false,"hidden":false,"merged":[[0,0,0,10],[14,5,14,7],[1,0,1,9],[6,8,7,8],[3,0,3,1],[5,0,5,9],[6,0,7,0],[6,1,7,1],[6,2,7,2],[6,3,7,3],[6,4,7,4],[6,5,6,7],[6,9,7,9]]}
["CONSULTING SERVICES"]
["Items added into this section will not impact the overall project duration.  These items add Consulting Services across the project implementation."]
[]
["# Services to Add",null,1]
[]
["CONSULTING SERVICES"]
{"$rows_left_out":10}
{"sheet":"Sprint-Prepare Task Details","index":7,"n_rows":85,"n_cols":8,"rows_kept":85,"cut":false,"hidden":false,"merged":[[0,0,0,8],[6,2,7,2],[6,3,7,3],[6,5,7,5],[6,4,7,4],[6,6,7,6],[6,7,7,7],[3,4,3,7],[6,0,7,0]]}
["SPRINT-INITIATE DETAILS"]
[]
[null,null,null,"Number of Rows to add:",70]
[null,null,null,"Release(s) to View (Read-only, copied from Feature Details worksheet)",{"$f":"IF(MLPFilter =\"\", \"\", MLPFilter)","v":""}]
[]
[]
{"$rows_left_out":80}
{"sheet":"CaseFeature Details","index":8,"n_rows":13,"n_cols":27,"rows_kept":13,"cut":false,"hidden":false,"merged":[[6,2,7,2],[6,1,7,1],[6,0,7,0],[12,8,12,12],[6,3,7,3],[6,4,7,4],[6,5,7,5],[6,6,7,6],[6,7,7,7],[6,17,7,17],[6,18,7,18],[6,19,7,19],[6,20,7,20],[6,8,6,12],[6,15,7,15],[6,16,7,16],[6,13,7,13],[6,14,7,14],[0,0,0,5],[2,2,2,3],[3,2,3,3],[3,4,3,5],[4,2,4,3],[4,4,4,5]]}
["CASE TYPE & FEATURE DETAILS"]
[]
[null,null,"Number of Rows to add:",null,24]
[null,null,"Release(s) to View (comma delimited list)",null,{"$f":"IF(MLPFilter =\"\", \"\", MLPFilter)","v":""}]
[null,null,"Sprints(s) to View (comma delimited list)"]
[]
{"$rows_left_out":8}
{"sheet":"ReportsCorr","index":9,"n_rows":13,"n_cols":20,"rows_kept":13,"cut":false,"hidden":false,"merged":[[2,1,2,3],[3,1,3,3],[0,0,0,12],[3,4,3,6],[6,0,6,6],[4,1,4,3],[4,4,4,6]]}
["REPORTS AND CORRESPONDENCES"]
[]
[null,"Number of Rows to add:",null,null,1]
[null,"Release(s) to View (Read-only, copied from CaseFeature Details worksheet)",null,null,{"$f":"IF(MLPFilter =\"\", \"\", MLPFilter)","v":""}]
[null,"Sprints(s) to View (Read-only, copied from CaseFeature Details worksheet)",null,null,{"$f":"IF('CaseFeature Details'!E5=\"\", \"\", 'CaseFeature Details'!E5)","v":""}]
[]
{"$rows_left_out":8}
{"sheet":"Interfaces","index":10,"n_rows":13,"n_cols":22,"rows_kept":13,"cut":false,"hidden":false,"merged":[[2,1,2,3],[3,1,3,3],[3,4,3,7],[0,0,0,16],[6,0,6,9],[4,1,4,3],[4,4,4,7]]}
["INTERFACES"]
[]
[null,"Number of Rows to add:",null,null,11]
[null,"Release(s) to View (Read-only, copied from CaseFeature Details worksheet)",null,null,{"$f":"IF(MLPFilter =\"\", \"\", MLPFilter)","v":""}]
[null,"Sprints(s) to View (Read-only, copied from CaseFeature Details worksheet)",null,null,{"$f":"IF('CaseFeature Details'!E5=\"\", \"\", 'CaseFeature Details'!E5)","v":""}]
[]
{"$rows_left_out":8}
{"sheet":"CDH","index":11,"n_rows":13,"n_cols":16,"rows_kept":13,"cut":false,"hidden":false,"merged":[[2,1,2,3],[3,1,3,3],[0,0,0,11],[6,0,6,6],[4,1,4,3],[3,4,3,9],[4,4,4,9]]}
["PEGA CUSTOMER DECISION HUB"]
[]
[null,"Number of Rows to add:",null,null,2]
[null,"Release(s) to View (Read-only, copied from CaseFeature Details worksheet)",null,null,{"$f":"IF(MLPFilter =\"\", \"\", MLPFilter)","v":""}]
[null,"Sprints(s) to View (Read-only, copied from CaseFeature Details worksheet)",null,null,{"$f":"IF('CaseFeature Details'!E5=\"\", \"\", 'CaseFeature Details'!E5)","v":""}]
[]
{"$rows_left_out":8}
{"sheet":"Sprint-Z Hardening Details","index":12,"n_rows":13,"n_cols":8,"rows_kept":13,"cut":false,"hidden":false,"merged":[[0,0,0,8],[3,4,3,7],[6,0,7,0],[6,2,7,2],[6,3,7,3],[6,4,7,4],[6,5,7,5],[6,6,7,6],[6,7,7,7]]}
["SPRINT-Z HARDENING DETAILS"]
[]
[null,null,null,"Number of Rows to add:",1]
[null,null,null,"Release(s) to View (Read-only, copied from Feature Details worksheet)"]
[]
[]
{"$rows_left_out":8}
{"sheet":"CTB Import","index":13,"n_rows":7,"n_cols":2,"rows_kept":7,"cut":false,"hidden":true,"merged":[[0,0,0,11],[2,1,2,10],[3,1,3,10],[6,1,6,10]]}
["CASE TYPE BACKLOG DATA IMPORT TOOL"]
[]
[null,"Select Case Type Backlog File to import (CTB file must be v24 or newer)"]
[]
[]
[]
{"$rows_left_out":2}
{"sheet":"EZ Sizer Import","index":14,"n_rows":7,"n_cols":2,"rows_kept":7,"cut":false,"hidden":true,"merged":[[0,0,0,11],[2,1,2,10],[3,1,3,10],[6,1,6,10]]}
["EZ SIZER DATA IMPORT TOOL"]
[]
[null,"Select the EZ Sizer export file to import "]
[]
[]
[]
{"$rows_left_out":2}
{"sheet":"Scaling","index":15,"n_rows":170,"n_cols":26,"rows_kept":170,"cut":false,"hidden":true,"merged":[[110,22,110,25],[125,11,125,13],[158,4,158,8],[15,18,15,20],[110,18,110,21],[41,1,44,1],[37,1,40,1],[15,9,15,15],[125,2,125,4],[125,5,125,7],[110,10,110,13],[110,2,110,5],[110,6,110,9],[110,14,110,17],[125,8,125,10],[0,0,0,6],[10,1,10,2],[15,2,15,8],[27,1,31,1],[32,1,36,1],[22,1,26,1],[17,1,21,1]]}
["CUSTOM SCALING SETTINGS"]
[]
["General Project","Design/Test Factors","Use Cases %","Interfaces %","Reports/ Corr %"]
[null,"I",0.13,0.1,0.05]
[null,"E",0.32,0.2,0.2]
[null,"C",0.55000000000000004,0.7,0.75]
{"$rows_left_out":165}
{"sheet":"Resource Planning","index":16,"n_rows":69,"n_cols":20,"rows_kept":69,"cut":false,"hidden":true,"merged":[[1,19,1,20],[1,3,1,14],[0,0,0,14],[3,1,9,1],[6,2,9,2],[6,10,9,10],[3,0,9,0],[2,0,2,14],[5,6,9,6],[3,2,5,5],[1,17,1,18],[68,3,68,5],[67,0,67,1],[68,0,68,1],[67,2,68,2],[67,6,68,6],[67,15,68,15],[3,6,3,9],[3,10,5,13],[68,7,68,9],[68,11,68,13],[67,10,68,10],[3,14,5,14],[67,14,68,14],[5,7,5,8]]}
["RESOURCE PLANNING"]
[null,null,null,null,null,null,null,null,null,null,null,null,null,null,null,null,null,"Elapsed Time: ",null,"0.02 sec"]
["PROPOSED STAFFING PLAN"]
["SOURCE","ROLE","SPRINT-INITIATE",null,null,null,"SPRINT 1- N",null,null,null,"SPRINT-Z",null,null,null,"TOTAL \n(HRS)",1]
[null,null,null,null,null,null,null,"Sprint-1","Sprint-1","Sprint-9",null,null,null,null,null,{"$f":"\"Hide\"","v":"Hide"}]
[null,null,null,null,null,null,"#","Sprint-1",null,null,null,null,null,null,null,1]
{"$rows_left_out":64}
{"sheet":"StaffingPlanExport","index":17,"n_rows":18,"n_cols":22,"rows_kept":18,"cut":false,"hidden":true,"merged":[[0,0,3,0],[0,1,3,1],[0,2,1,4],[0,5,0,17],[0,18,1,20],[2,2,3,2],[16,21,17,21],[0,21,1,21],[1,5,3,5],[1,6,1,7],[1,8,1,9],[1,10,1,11],[1,12,1,13],[1,14,1,15],[1,16,1,17],[2,18,3,18],[17,0,17,1],[17,3,17,4],[17,6,17,17],[17,19,17,20],[16,0,16,1],[16,2,17,2],[16,5,17,5],[16,18,17,18]]}
["SOURCE","ROLE","SPRINT-INITIATE",null,null,"SPRINT 1- N",null,null,null,null,null,null,null,null,null,null,null,null,"SPRINT-Z",null,null,"TOTAL \n(HRS)"]
[null,null,null,null,null,"#","Sprint-1",null,"Sprint-2",null,"Sprint-3",null,"Sprint-4",null,"Sprint-5",null,"Sprint-6"]
[null,null,"#","2021-02-22","2021-03-01",null,"2021-03-08","2021-03-15","2021-03-22","2021-03-29","2021-04-05","2021-04-12","2021-04-19","2021-04-26","2021-05-03","2021-05-10","2021-05-17","2021-05-24","#","2021-05-31","2021-06-07","2021-06-11"]
[null,null,null,"w1","w2",null,"w3","w4","w5","w6","w7","w8","w9","w10","w11","w12","w13","w14",null,"w15","w16","16 Wks"]
["Pega","Project Delivery Leader",1,60,60,1,40,40,40,40,40,40,40,40,40,40,40,40,1,40,40,680]
["Pega","(L/S) Business Architect",0,0,0,1,40,40,40,40,40,40,40,40,40,40,40,40,0,0,0,480]
{"$rows_left_out":13}
{"sheet":"Rapid Delivery Planning","index":18,"n_rows":69,"n_cols":20,"rows_kept":69,"cut":false,"hidden":true,"merged":[[67,16,68,16],[67,10,68,10],[67,15,68,15],[67,14,68,14],[3,14,5,14],[6,10,9,10],[68,11,68,13],[3,10,5,13],[3,16,9,16],[3,0,9,0],[5,6,9,6],[6,2,9,2],[3,2,5,5],[3,1,9,1],[3,6,3,9],[5,7,5,8],[0,0,0,20],[1,3,1,14],[1,17,1,18],[1,19,1,20],[2,0,2,14],[68,7,68,9],[67,0,67,1],[67,2,68,2],[67,6,68,6],[68,0,68,1],[68,3,68,5]]}
["RAPID DELIVERY RESOURCE PLANNING"]
[null,null,null,null,null,null,null,null,null,null,null,null,null,null,null,null,null,"Elapsed Time: ",null,"0.06 sec"]
["PROPOSED STAFFING PLAN",null,null,null,null,null,null,null,null,null,null,null,null,null,null,null,"I"]
["SOURCE","ROLE","SPRINT-INITIATE",null,null,null,"Release 2",null,null,null,"SPRINT-Z",null,null,null,"TOTAL \n(HRS)",1,"FPR Hours"]
[null,null,null,null,null,null,null,"Sprint-1","Sprint-1",null,null,null,null,null,null,{"$f":"\"Hide\"","v":"Hide"}]
[null,null,null,null,null,null,"#","Sprint-1",null,null,null,null,null,null,null,1]
{"$rows_left_out":64}
{"sheet":"Calculations Page","index":19,"n_rows":27,"n_cols":5,"rows_kept":27,"cut":false,"hidden":true,"merged":[]}
[]
[null,"BRE Factor:",{"$f":"IF('Scrum Summary'!C6 = \"BRE\",0,1)","v":1}]
[]
[]
[null,"Sprint0MaxBill",{"$f":"'Sprint-Prepare'!D5*'Sprint-Prepare'!D6","v":80}]
[null,"Sprint1NMaxBill",{"$f":"'Sprint 1-Sprint N'!D5*'Sprint 1-Sprint N'!D6*NumSprints","v":80}]
{"$rows_left_out":22}
{"sheet":"DropDowns","index":20,"n_rows":33,"n_cols":26,"rows_kept":33,"cut":false,"hidden":true,"merged":[]}
[]
["Item Maturity",null,"Case Item Types",null,"Work Effort Resource Roles","Design","Build","Test",null,"Scrum Roles",null,"Resource Source",null,"Staffing",null,"PRPC Version",null,"Project Lead",null,"Consulting Services",null,"Tab Order",null,"Sprint-0 Item Types",null,"Complexity"]
["<Select>",null,"<Select>",null,"<Select>",{"$f":"IFERROR(VLOOKUP(DropDowns!$E3,Table2[],2,0),0)","v":0},{"$f":"IFERROR(VLOOKUP(DropDowns!$E3,Table2[],3,0),0)","v":0},{"$f":"IFERROR(VLOOKUP(DropDowns!$E3,Table2[],4,0),0)","v":0},null,"<Select>",null,"<Select>",null,"<Select>",null,"<Select>",null,"<Select>",null,"<Select a Service>",null,{"$f":"MID(CELL(\"filename\",'Scrum Summary'!$A$1),FIND(\"]\",CELL(\"filename\",'Scrum Summary'!$A$1))+1,255)","v":"Scrum Summary"},null,"<Select>",null,"<Select>"]
["New",null,"- CASE TYPE SECTION -",null,"Practice Leader",{"$f":"IFERROR(VLOOKUP(DropDowns!$E4,Table2[],2,0),0)","v":0},{"$f":"IFERROR(VLOOKUP(DropDowns!$E4,Table2[],3,0),0)","v":0},{"$f":"IFERROR(VLOOKUP(DropDowns!$E4,Table2[],4,0),0)","v":0},null,"Scrum Master",null,"Pega",null,"Pega ",null,8.6,null,"Pega Led / Pega Powered",null,"Application Governance",null,{"$f":"MID(CELL(\"filename\",'Sprint-Prepare'!$A$1),FIND(\"]\",CELL(\"filename\",'Sprint-Prepare'!$A$1))+1,255)","v":"Sprint-Prepare"},null,"- SECTION HEADER -",null,"OOTB"]
["Extend",null,"Case Type",null,"Project Delivery Leader",{"$f":"IFERROR(VLOOKUP(DropDowns!$E5,Table2[],2,0),0)","v":0},{"$f":"IFERROR(VLOOKUP(DropDowns!$E5,Table2[],3,0),0)","v":0},{"$f":"IFERROR(VLOOKUP(DropDowns!$E5,Table2[],4,0),0)","v":0},null,"Team Member",null,"Client",null,"Client ",null,8.5,null,"Pega Led / Partner Powered",null,"Delivery Excellence Workshop (DEW)",null,{"$f":"MID(CELL(\"filename\",'Sprint 1-Sprint N'!$A$1),FIND(\"]\",CELL(\"filename\",'Sprint 1-Sprint N'!$A$1))+1,255)","v":"Sprint 1-Sprint N"},null,"Initiate Task",null,"Low"]
["OOB (Existing)",null,"Stage",null,"(L/S) Business Architect",{"$f":"IFERROR(VLOOKUP(DropDowns!$E6,Table2[],2,0),0)","v":0.8},{"$f":"IFERROR(VLOOKUP(DropDowns!$E6,Table2[],3,0),0)","v":0.1},{"$f":"IFERROR(VLOOKUP(DropDowns!$E6,Table2[],4,0),0)","v":0.1},null,"Other (non-Dev)",null,"Partner",null,"Partner ",null,8.4,null,"Partner Led ",null,"Deployment",null,{"$f":"MID(CELL(\"filename\",'Sprint-Z Hardening'!$A$1),FIND(\"]\",CELL(\"filename\",'Sprint-Z Hardening'!$A$1))+1,255)","v":"Sprint-Z Hardening"},null,"Infrastructure Task",null,"Medium"]
{"$rows_left_out":28}
{"sheet":"Work Effort","index":21,"n_rows":20,"n_cols":10,"rows_kept":20,"cut":false,"hidden":true,"merged":[]}
["Work Effort Resource Roles","Design","Build","Test",null,null,"Type","Design","Build","Test"]
["Practice Leader",0,0,0,null,null,"CaseFeatures",0.3,0.4,0.3]
["Project Delivery Leader",0,0,0,null,null,"Reports",0.04,0.8,0.16]
["(L/S) Business Architect",0.8,0.1,0.1,null,null,"Interfaces",0.3,0.4,0.3]
["Lead System Architect",0.8,0.2,0,null,null,"Marketing",0.25,0.5,0.25]
["(Sr) System Architect",0.2,0.8,0]
{"$rows_left_out":15}
{"sheet":"DataExtract","index":22,"n_rows":61,"n_cols":26,"rows_kept":61,"cut":false,"hidden":true,"merged":[]}
["Client/Organization"]
["Project"]
[]
["Area","Grouping"]
["AP ID"]
["AP Mode",null,"{"]
{"$rows_left_out":56}
{"sheet":"EZS Data","index":23,"n_rows":0,"n_cols":0,"rows_kept":0,"cut":false,"hidden":true,"merged":[]}

{"sheet":"ResourceAndOther","index":24,"n_rows":31,"n_cols":13,"rows_kept":31,"cut":false,"hidden":true,"merged":[[0,0,0,5],[17,0,17,5]]}
["Co-production"]
["Scrum Role","Source","Role","Part Time %","Productivity","Allocation",null,null,"Attributes","Values","Vlookup ID","Parameter","% increase"]
["Scrum Master","Pega","Project Delivery Leader",1,1,0,null,null,"Delivery","Waterfall/Other","Delivery:Waterfall/Other","Non Scrum",0.2]
["Team Member","Pega","(L/S) Business Architect",1,1,0.5,null,null,"Scrum maturity","Low","Scrum maturity:2","Scrum maturity: Low",7.4999999999999997E-2]
["Team Member","Pega","Lead System Architect",1,1,0.5,null,null,"Scrum maturity","Medium","Scrum maturity:3","Scrum maturity: Medium",0.15]
["Team Member","Pega","(Sr) System Architect",1,1,1,null,null,"Environment","New on Prem","Environment:New on Prem","New On-Prem implementation",0.1]
{"$rows_left_out":25}