{"text_format":"1","workbook":"xlsx","n_sheets":17,"sheets":["Project Summary","TCP Extract","Assumptions","Microjourneys","Case Types","Supporting Features","Interfaces","Personas","Reports","Work Backlog","Project Attributes","Reference Sizing","Calculations","Staffing","ExportScrumSizing","Dropdowns","Tabs"],"not_rendered":{"charts":0,"images":2,"macros":1,"external_links":0,"defined_names":161,"comments":6,"pivot_tables":0},"unopened":[],"bounds":{"document_bytes":16777216,"sheet_cells":100000,"rows_first":2000,"rows_last":500,"rows_between":2000,"halvings":0,"cell_chars":16384,"cell_head_chars":4096},"cells_cut":0,"cells_raw":0,"read":"whole","date_system":"1900"}

{"sheet":"Project Summary","index":0,"n_rows":10,"n_cols":9,"rows_kept":10,"cut":false,"hidden":false,"merged":[[0,0,0,9],[1,3,1,4],[1,6,1,9],[4,0,4,2],[3,0,3,9],[4,5,4,7],[4,3,4,4],[4,8,4,9],[1,0,1,1],[5,5,5,7],[9,0,9,1],[9,2,9,9],[8,0,8,9],[6,0,6,2],[6,3,6,4],[6,5,6,7],[6,8,6,9],[5,0,5,2],[5,8,5,9],[5,3,5,4]]}
["CASE TYPE BACKLOG TOOL"]
["Release Date:",null,"2019-10-24","Tool Version:",null,"v-36",{"$f":"\"© \" & YEAR($C2) &\" Pegasystems, Inc. All rights reserved.\"","v":"© 2019 Pegasystems, Inc. All rights reserved."}]
[]
["CLIENT / ENGAGEMENT DATA"]
["*Client Name:",null,null,null,null,"* Engagement Name:"]
["*Sizing Generated By:",null,null,null,null,"*Sizing Verified By:"]
["Created:",null,null,"2019-06-24T12:21:28",null,"Last Modified:",null,null,"2019-10-02T16:28:36"]
[]
{"$rows_left_out":3}
{"sheet":"TCP Extract","index":1,"n_rows":17,"n_cols":3,"rows_kept":17,"cut":false,"hidden":true,"merged":[]}
["Name","Value","Units"]
["No. of Case Types",{"$f":"Calculations!$B$4","v":0}]
["Average Complexity",{"$f":"Calculations!$B$5","v":0}]
["No. of Personas",{"$f":"Calculations!$B$6","v":0}]
["No. of New Interfaces",{"$f":"Calculations!$B$8","v":0}]
["No. of Existing Interfaces",{"$f":"Calculations!$B$9","v":0}]
["No. of Channels",{"$f":"Scope[[#This Row],[MLP Scope]]","v":0}]
["No. of Reports and Corr",{"$f":"Calculations!$B$11","v":0}]
{"$rows_left_out":10}
{"sheet":"Assumptions","index":2,"n_rows":51,"n_cols":1,"rows_kept":51,"cut":false,"hidden":false,"merged":[[28,1,28,9],[23,1,23,9],[24,1,24,9],[25,1,25,9],[26,1,26,9],[27,1,27,9],[47,1,47,9],[48,1,48,9],[49,1,49,9],[30,1,30,9],[31,1,31,9],[32,1,32,9],[33,1,33,9],[34,1,34,9],[50,1,50,9],[4,1,4,9],[3,1,3,9],[41,1,41,9],[42,1,42,9],[43,1,43,9],[44,1,44,9],[45,1,45,9],[46,1,46,9],[35,1,35,9],[36,1,36,9],[37,1,37,9],[38,1,38,9],[39,1,39,9],[40,1,40,9],[29,1,29,9],[22,1,22,9],[11,1,11,9],[12,1,12,9],[13,1,13,9],[14,1,14,9],[15,1,15,9],[16,1,16,9],[17,1,17,9],[18,1,18,9],[19,1,19,9],[20,1,20,9],[21,1,21,9],[10,1,10,9],[0,0,0,9],[5,1,5,9],[6,1,6,9],[7,1,7,9],[8,1,8,9],[9,1,9,9],[2,1,2,9],[1,1,1,9]]}
["ASSUMPTIONS"]
[1]
[2]
[3]
[4]
[5]
[6]
[7]
{"$rows_left_out":44}
{"sheet":"Microjourneys","index":3,"n_rows":9,"n_cols":3,"rows_kept":9,"cut":false,"hidden":false,"merged":[[8,2,8,3],[2,0,2,3],[3,2,3,3],[4,2,4,3],[6,2,6,3],[7,2,7,3],[5,2,5,3]]}
[]
[null,null,2]
["Microjourneys"]
["#","Microjourney","Description"]
[{"$f":"ROW()-5","v":0}]
[{"$f":"ROW()-5","v":1}]
[{"$f":"ROW()-5","v":2}]
[{"$f":"A7-1","v":1},{"$f":"COUNTA(JourneyList)","v":0}]
{"$rows_left_out":2}
{"sheet":"Case Types","index":4,"n_rows":10,"n_cols":9,"rows_kept":10,"cut":false,"hidden":false,"merged":[[2,0,2,8],[3,0,4,0],[3,1,4,1],[3,3,4,3],[3,4,3,7],[3,8,4,8],[3,2,4,2]]}
[]
[null,null,null,null,2]
["Case Types"]
["#","Case Type","Parent Microjourney(s)\n(Multi-Select)","Average Complexity","Channels",null,null,null,"Assumptions"]
[null,null,null,null,"Call Center / Desktop","Mobile App","Web Self Service","Other"]
[{"$f":"ROW()-6","v":0},null,null,"<Select>",1,0,0,0]
[{"$f":"ROW()-6","v":1},null,null,"<Select>",1,0,0,0]
[{"$f":"ROW()-6","v":2},null,null,"<Select>",1,0,0,0]
{"$rows_left_out":3}
{"sheet":"Supporting Features","index":5,"n_rows":10,"n_cols":9,"rows_kept":10,"cut":false,"hidden":false,"merged":[[12,3,12,8],[13,3,13,8],[14,3,14,8],[15,3,15,8],[2,0,2,8],[3,0,4,0],[3,1,4,1],[3,2,4,2],[3,3,4,3],[3,4,3,7],[3,8,4,8]]}
[]
[null,null,null,null,2]
["Supporting Features"]
["#","Feature","Which Case Types is this Feature in support of? \n(Multi-Select)","Average Complexity","Channels",null,null,null,"Assumptions"]
[null,null,null,null,"Call Center / Desktop","Mobile App","Web Self Service","Other"]
[{"$f":"ROW()-6","v":0},null,null,"<Select>",1,0,0,0]
[{"$f":"ROW()-6","v":1},null,null,"<Select>",1,0,0,0]
[{"$f":"ROW()-6","v":2},null,null,"<Select>",1,0,0,0]
{"$rows_left_out":3}
{"sheet":"Interfaces","index":6,"n_rows":9,"n_cols":7,"rows_kept":9,"cut":false,"hidden":false,"merged":[[2,0,2,6],[12,4,12,6],[13,4,13,6],[14,4,14,6]]}
[]
[null,null,null,null,null,2]
["Interfaces"]
["#","Interface Name","Service  or Connector  ","Interface / Data Source Type","Complexity","Interface Data Source Exists?","Assumptions"]
[{"$f":"ROW()-5","v":0},null,"<Select>","<Select>","<Select>","<Select>"]
[{"$f":"ROW()-5","v":1},null,"<Select>","<Select>","<Select>","<Select>"]
[{"$f":"ROW()-5","v":2},null,"<Select>","<Select>","<Select>","<Select>"]
[{"$f":"A7-1","v":1},{"$f":"countunique(B5:B7)-1","v":0},null,null,{"$f":"IFERROR(MAX(SumOfVlookup(E5:E7,Dropdowns!$D$2:$E$5,\"\")/$A8,1),0)","v":1},{"$f":"MAX(COUNTIF(F5:F7, \"No\")+COUNTIF(F5:F7, \"Unknown\")+COUNTIF(F5:F7, \"?Select?\")-2,0)","v":1}]
{"$rows_left_out":2}
{"sheet":"Personas","index":7,"n_rows":9,"n_cols":3,"rows_kept":9,"cut":false,"hidden":false,"merged":[[7,2,7,3],[8,2,8,3],[6,2,6,3],[2,0,2,3],[3,2,3,3],[4,2,4,3],[5,2,5,3]]}
[]
[null,null,2]
["Personas"]
["#","Personas","Assumptions"]
[{"$f":"ROW()-5","v":0}]
[{"$f":"ROW()-5","v":1}]
[{"$f":"ROW()-5","v":2}]
[{"$f":"A7-1","v":1},{"$f":"COUNTA(RoleList)","v":0}]
{"$rows_left_out":2}
{"sheet":"Reports","index":8,"n_rows":10,"n_cols":5,"rows_kept":10,"cut":false,"hidden":false,"merged":[[11,2,11,4],[12,2,12,4],[13,2,13,6],[2,0,2,4],[3,0,4,0],[3,1,4,1],[3,2,4,2],[3,4,4,4],[3,3,4,3]]}
[]
[null,null,2]
["Reports & Correspondences"]
["#","Report or Correspondence","Average Complexity","MLP Release","Assumptions"]
[]
[{"$f":"ROW()-6","v":0},null,"<Select>","<Select>"]
[{"$f":"ROW()-6","v":1},null,"<Select>","<Select>"]
[{"$f":"ROW()-6","v":2},null,"<Select>","<Select>"]
{"$rows_left_out":3}
{"sheet":"Work Backlog","index":9,"n_rows":10,"n_cols":17,"rows_kept":10,"cut":false,"hidden":false,"merged":[[1,6,1,7],[1,8,1,9],[0,0,0,16],[1,0,1,5],[1,10,1,13]]}
["Case Type Backlog"]
["Work To Do",null,null,null,null,null,"Interfaces",null,"Personas",null,"Channels",null,null,null,"Biz Value","Release","Sizing Assumptions"]
["#","C or F","Microjourney","Case Type/ Feature","Which case types is this feature in support of?","Average Complexity",null,null,null,null,"Call Center / Desktop","Mobile App","Web Self Service","Other","L/M/H","MLP Release","Assumptions"]
[{"$f":"ROW()-4","v":0},null,{"$f":"IF(NumJourneys >0, IFERROR(_xlfn.IFS(B4=\"\", \"\", B4=\"C\", VLOOKUP(D4,'Case Types'!$B$6:$C$8,2,0), B4=\"F\",IF(E4 = \"All\", 'Case Types'!$C$10, SplitAndMatch(E4, \"CTMJ\", 2)) ), \"\"),\"\")","v":""},null,{"$f":"IFERROR(VLOOKUP(D4,'Supporting Features'!$B$6:$C$8,2,0),\"\")","v":""},"<Select>",null,null,null,null,0,0,0,0,"<Select>","<Select>"]
[{"$f":"ROW()-4","v":1},"C",{"$f":"IF(NumJourneys >0, IFERROR(_xlfn.IFS(B5=\"\", \"\", B5=\"C\", VLOOKUP(D5,'Case Types'!$B$6:$C$8,2,0), B5=\"F\",IF(E5 = \"All\", 'Case Types'!$C$10, SplitAndMatch(E5, \"CTMJ\", 2)) ), \"\"),\"\")","v":""},null,{"$f":"IFERROR(VLOOKUP(D5,'Supporting Features'!$B$6:$C$8,2,0),\"\")","v":""},"<Select>",null,null,null,null,1,0,0,0,"<Select>"]
[{"$f":"ROW()-4","v":2},"F",{"$f":"IF(NumJourneys >0, IFERROR(_xlfn.IFS(B6=\"\", \"\", B6=\"C\", VLOOKUP(D6,'Case Types'!$B$6:$C$8,2,0), B6=\"F\",IF(E6 = \"All\", 'Case Types'!$C$10, SplitAndMatch(E6, \"CTMJ\", 2)) ), \"\"),\"\")","v":""},null,{"$f":"IFERROR(VLOOKUP(D6,'Supporting Features'!$B$6:$C$8,2,0),\"\")","v":""},"<Select>",null,null,null,null,1,0,0,0,"<Select>"]
[{"$f":"ROW()-4","v":3},"F",{"$f":"IF(NumJourneys >0, IFERROR(_xlfn.IFS(B7=\"\", \"\", B7=\"C\", VLOOKUP(D7,'Case Types'!$B$6:$C$8,2,0), B7=\"F\",IF(E7 = \"All\", 'Case Types'!$C$10, SplitAndMatch(E7, \"CTMJ\", 2)) ), \"\"),\"\")","v":""},null,{"$f":"IFERROR(VLOOKUP(D7,'Supporting Features'!$B$6:$C$8,2,0),\"\")","v":""},"<Select>",null,null,null,null,0,0,0,0,"<Select>","<Select>"]
[{"$f":"A7-1","v":2},null,null,{"$f":"COUNTA(Case_Types)","v":0},null,{"$f":"\"$F$\"&ROW(AvgComplexity)+1&\":$F$\"&ROW(AvgComplexity)+ROWS(AvgComplexity)-2","v":"$F$5:$F$7"},null,null,null,null,{"$f":"ADDRESS(ROW(CallCenter)+1,COLUMN(CallCenter))&\":\"&ADDRESS(ROW(CallCenter)+ROWS(CallCenter)-2,COLUMN(CallCenter))","v":"$K$5:$K$7"},{"$f":"ADDRESS(ROW(MobileApp)+1,COLUMN(MobileApp))&\":\"&ADDRESS(ROW(MobileApp)+ROWS(MobileApp)-2,COLUMN(MobileApp))","v":"$L$5:$L$7"},{"$f":"ADDRESS(ROW(WebSelfServ)+1,COLUMN(WebSelfServ))&\":\"&ADDRESS(ROW(WebSelfServ)+ROWS(WebSelfServ)-2,COLUMN(WebSelfServ))","v":"$M$5:$M$7"},{"$f":"ADDRESS(ROW(Other)+1,COLUMN(Other))&\":\"&ADDRESS(ROW(Other)+ROWS(Other)-2,COLUMN(Other))","v":"$N$5:$N$7"}]
{"$rows_left_out":3}
{"sheet":"Project Attributes","index":10,"n_rows":22,"n_cols":6,"rows_kept":22,"cut":false,"hidden":false,"merged":[[0,0,0,5],[1,3,1,4],[13,3,13,4],[8,3,8,4],[3,3,3,4],[7,3,7,4],[4,3,4,4],[6,3,6,4],[9,3,9,4],[2,3,2,4],[13,1,13,2],[6,0,7,0],[9,0,11,0],[13,0,16,0],[15,3,15,4],[17,3,17,4],[21,3,21,4],[5,3,5,4],[12,3,12,4],[10,3,10,4],[16,3,16,4],[14,3,14,4],[11,3,11,4],[20,3,20,4],[18,3,18,4],[19,3,19,4],[21,1,21,2],[1,1,1,2],[4,1,4,2],[8,1,8,2],[9,1,9,2],[10,1,10,2],[11,1,11,2],[12,1,12,2],[2,1,2,2],[3,1,3,2],[5,1,5,2],[6,1,6,2],[7,1,7,2],[14,1,14,2],[15,1,15,2],[16,1,16,2],[18,0,19,0],[2,0,4,0],[18,1,18,2],[19,1,19,2],[20,1,20,2],[17,1,17,2]]}
["PROJECT ATTRIBUTES"]
["ATTRIBUTE TYPE","ATTRIBUTE NAME",null,"ATTRIBUTE VALUE",null,"PROJECT ASSUMPTIONS"]
["Platform / Application Info","Pega Version:",null,"8.3"]
[null,"Application Name:"]
[null,"Application Version:"]
[]
["Co-Production","Staffing Model:",null,"Co-Production"]
[null,"Engagement Lead:",null,"Pega Led / Client Co-Prod"]
{"$rows_left_out":15}
{"sheet":"Reference Sizing","index":11,"n_rows":18,"n_cols":26,"rows_kept":18,"cut":false,"hidden":false,"merged":[[2,0,20,0],[19,2,19,17],[4,2,18,2],[4,17,18,17],[18,3,18,16],[6,14,7,14],[8,4,9,4],[8,8,9,8],[8,9,9,9],[9,14,9,15],[13,4,14,4],[13,8,14,8],[13,9,14,9],[14,14,14,15],[0,3,0,16],[13,3,15,3],[16,3,17,3],[16,4,17,4],[15,14,15,15],[5,14,5,15],[6,3,10,3],[6,13,7,13],[8,14,8,15],[8,13,12,13],[4,6,17,6],[11,3,12,3],[2,19,20,19],[3,18,19,18],[4,3,5,4],[4,8,4,9],[4,10,17,10],[4,11,17,11],[4,12,17,12],[4,13,4,16],[11,14,11,15],[12,14,12,15],[13,13,17,13],[13,14,13,15],[16,8,17,9],[17,14,17,15],[16,14,16,15],[10,14,10,15]]}
[null,null,null,"Reference Sizing Chart"]
[]
[]
[]
[null,null,null,"PARAMETERS FOR SIZING",null,null,null,null,"ENGAGEMENT SCOPE",null,null,null,null,"ESTIMATE RESULTS"]
[null,null,null,null,null,null,null,null,"MLP Scope","Full Program",null,null,null,"CATEGORY","SUB-CATEGORY",null,"DETAIL"]
[null,null,null,"Process Complexity","Case Types & Features",null,null,null,{"$f":"Calculations!B4","v":0},{"$f":"Calculations!C4","v":0},null,null,null,"Staffing Model",{"$f":"IF(CoProdFlag, \"\", \"Not \") & \"Co-Production\"","v":"Co-Production"},{"$f":"IFERROR(IF(SEARCH(\"Partner\", 'Project Attributes'!D8), \"Partner\", \"Pega\"), \"Pega\")","v":"Pega"},{"$f":"Table7[[#Totals],[Text]]& IF(OR(RobotFlag=\"Yes\", DSMFlag), CHAR(10)& IF(RobotFlag=\"Yes\", Table5[[#Totals],[text]] & \"  \", \"\") & IF(DSMFlag, Table53[[#Totals],[text]], \"\"),\"\")","v":"1 Scrum Team: 1 EL, 1 (L/S)BA, 1 LSA, 2 (S)SA, ½ UX/UI"}]
[null,null,null,null,"Average Complexity",null,null,null,{"$f":"IF(I7>0,Calculations!S4,\"\")","v":""},{"$f":"IF(J7>0,Calculations!V4,\"\")","v":""},null,null,null,null,null,"Client\n(full time)",{"$f":"Table8[[#Totals],[Text]]","v":"1 Product Owner, \n1 Test Lead, 2 Tester, 1 Pega Certified BA, 2 Pega Certified SA"}]
{"$rows_left_out":11}
{"sheet":"Calculations","index":12,"n_rows":62,"n_cols":28,"rows_kept":62,"cut":false,"hidden":true,"merged":[[1,0,1,4],[1,15,1,21],[0,0,0,21],[1,8,1,11],[20,15,20,17],[22,8,22,11],[29,15,29,21],[40,16,42,16],[40,17,42,21],[34,15,42,15],[30,17,30,21],[34,16,36,16],[34,17,36,21],[37,16,39,16],[37,17,39,21],[52,15,52,18],[31,15,33,15],[31,16,33,16],[31,17,33,21],[45,15,45,27]]}
["CALCULATIONS, FACTORS, & OTHER DATA ELEMENTS"]
["Calculations",null,null,null,null,null,null,null,"Factors",null,null,null,null,null,null,"Other Data/Calc Elements"]
["Parameters","MLP Scope","Full Program","MLP Hours","Full Hours",null,null,null,"Parameter","Hours","Effort Factor","Minimum",null,null,null,"Complexity Type","MLP Low","MLP High","MLP","Full Low","Full High","Full"]
["Number of Case Types & Features",{"$f":"'Work Backlog'!$A$10","v":0},{"$f":"'Work Backlog'!D8","v":0},{"$f":"ROUND(Scope[[#This Row],[MLP Scope]]*$J4,0)","v":0},{"$f":"ROUND(Scope[[#This Row],[Full Program]]*$J4,0)","v":0},null,null,null,"Number of Case Types & Features",12,null,null,null,null,null,"Case/Features Complexity",{"$f":"IFERROR(VLOOKUP(ROUNDDOWN($B$5,0),Dropdowns!$J$3:$K$7,2,0), \"OOTB\")","v":"OOTB"},{"$f":"IFERROR(VLOOKUP(ROUNDUP($B$5,0),Dropdowns!$J$3:$K$7,2,0), \"OOTB\")","v":"OOTB"},{"$f":"IF(Q4<>R4,Q4&\"-\"&R4,Q4)","v":"OOTB"},{"$f":"VLOOKUP(ROUNDDOWN($C$5,0),Dropdowns!$J$3:$K$7,2,0)","v":"OOTB"},{"$f":"VLOOKUP(ROUNDUP($C$5,0),Dropdowns!$J$3:$K$7,2,0)","v":"OOTB"},{"$f":"IF(T4<>U4,T4&\"-\"&U4,T4)","v":"OOTB"}]
["Average Complexity (Case & Features)",{"$f":"'Work Backlog'!$F$10","v":0},{"$f":"'Work Backlog'!$F$9","v":1},{"$f":"MAX(ROUND((Scope[[#This Row],[MLP Scope]]-1)*$K5*$D4,0)-D4,0)","v":0},{"$f":"MAX(ROUND((Scope[[#This Row],[Full Program]]-1)*$K5*$E4,0)-E4,0)","v":0},null,null,null,"Average Complexity (Case & Features)",null,1.5,null,null,null,null,"Report Complexity",{"$f":"IFERROR(VLOOKUP(ROUNDDOWN($B$12,0),Dropdowns!$J$3:$K$7,2,0), \"OOTB\")","v":"OOTB"},{"$f":"IFERROR(VLOOKUP(ROUNDUP($B$12,0),Dropdowns!$J$3:$K$7,2,0), \"OOTB\")","v":"OOTB"},{"$f":"IF(Q5<>R5,Q5&\"-\"&R5,Q5)","v":"OOTB"},{"$f":"VLOOKUP(ROUNDDOWN($C$12,0),Dropdowns!$J$3:$K$7,2,0)","v":"OOTB"},{"$f":"VLOOKUP(ROUNDUP($C$12,0),Dropdowns!$J$3:$K$7,2,0)","v":"OOTB"},{"$f":"IF(T5<>U5,T5&\"-\"&U5,T5)","v":"OOTB"}]
["Number of Personas",{"$f":"SUM('Work Backlog'!$I$10:$J$10)","v":0},{"$f":"Personas!B8","v":0},{"$f":"MAX(ROUND((Scope[[#This Row],[MLP Scope]]-1)*$K6*SUM(D4,D5),0),0)","v":0},{"$f":"MAX(ROUND((Scope[[#This Row],[Full Program]]-1)*$K6*SUM(E4,E5),0),0)","v":0},null,null,null,"Number of Personas",null,0.02]
["Number of Channels",{"$f":"SUM('Work Backlog'!K10:N10)","v":0},{"$f":"IF(C4>0, SUM('Work Backlog'!K9:N9),0)","v":0},{"$f":"MAX(ROUND((Scope[[#This Row],[MLP Scope]]-1)*$K7*SUM(D4,D5),0),0)","v":0},{"$f":"MAX(ROUND((Scope[[#This Row],[Full Program]]-1)*$K7*SUM(E4,E5),0),0)","v":0},null,null,null,"Number of Channels",null,0.25]
["# of New Interface Data Sources",{"$f":"COUNTIF('Work Backlog'!G10:H10,\"No\")+COUNTIF('Work Backlog'!G10:H10,\"Unknown\")+COUNTIF('Work Backlog'!G10:H10,\"?Select?\")","v":0},{"$f":"Interfaces!F8","v":1},{"$f":"ROUND(Scope[[#This Row],[MLP Scope]]*$J8,0)","v":0},{"$f":"ROUND(Scope[[#This Row],[Full Program]]*$J8,0)","v":110},null,null,null,"# of New Interface Data Sources",110,null,null,null,null,null,"Flag","Value","Name","Bullet Item"]
{"$rows_left_out":55}
{"sheet":"Staffing","index":13,"n_rows":33,"n_cols":15,"rows_kept":33,"cut":false,"hidden":true,"merged":[[0,7,0,14]]}
["Pega/Partner","Role","Amt","NumScrumTeams","Total","Text",null,"Export"]
["Pega","EL",0.5,{"$f":"NumScrumTeams","v":1},{"$f":"IF(RoboticsOnlyClient, Table7[[#This Row],[Amt]], MAX(ROUNDUP(D2*C2,0),1))","v":1},{"$f":"IF(E2>0,IF(E2<1, VLOOKUP(Table7[[#This Row],[Total]],Table6[],2,0),E2)& \" \"&B2&\", \",\"\")","v":"1 EL, "},null,"Cnt","CTB Name","Scrum Role","Source","Role","PT %","Productivity","Allocation to Dev"]
["Pega","(L/S)BA",1,{"$f":"IF(OR(RoboticsOnlyClient,DSM_OnlyClient),0,NumScrumTeams)","v":1},{"$f":"D3*C3","v":1},{"$f":"IF(E3>0,IF(E3<1, VLOOKUP(Table7[[#This Row],[Total]],Table6[],2,0),E3)& \" \"&B3&\", \",\"\")","v":"1 (L/S)BA, "},null,1,"PL","Other (non-Dev)",{"$f":"'Reference Sizing'!$P$7","v":"Pega"},"Practice Leader",0.1,1,0]
["Pega","LSA",1,{"$f":"_xlfn.IFS(DSM_OnlyClient,1,RoboticsOnlyClient,0,NOT(AND(RoboticsOnlyClient,DSM_OnlyClient)), NumScrumTeams)","v":1},1,{"$f":"IF(E4>0,IF(E4<1, VLOOKUP(Table7[[#This Row],[Total]],Table6[],2,0),E4)& \" \"&B4&\", \",\"\")","v":"1 LSA, "},null,{"$f":"VLOOKUP(Table414[[#This Row],[CTB Name]],Table7[[Role]:[Total]],4,0)","v":1},"EL","Scrum Master",{"$f":"'Reference Sizing'!$P$7","v":"Pega"},"Engagement Leader",1,1,0]
["Pega","(S)SA",{"$f":"IF(CoProdFlag, 2, 3)","v":2},{"$f":"IF(OR(RoboticsOnlyClient,DSM_OnlyClient),0,NumScrumTeams)","v":1},2,{"$f":"IF(E5>0,IF(E5<1, VLOOKUP(Table7[[#This Row],[Total]],Table6[],2,0),E5)& \" \"&B5&\", \",\"\")","v":"2 (S)SA, "},null,{"$f":"VLOOKUP(Table414[[#This Row],[CTB Name]],Table7[[Role]:[Total]],4,0)","v":1},"(L/S)BA","Team Member",{"$f":"'Reference Sizing'!$P$7","v":"Pega"},"(L/S) Business Architect",1,1,0.5]
["Pega","UX/UI",0.5,{"$f":"IF(OR(RoboticsOnlyClient,DSM_OnlyClient),0,NumScrumTeams)","v":1},0.5,{"$f":"IF(E6>0,IF(E6<1, VLOOKUP(Table7[[#This Row],[Total]],Table6[],2,0),E6)& \" \"&B6&\", \",\"\")","v":"½ UX/UI, "},null,{"$f":"VLOOKUP(Table414[[#This Row],[CTB Name]],Table7[[Role]:[Total]],4,0)","v":1},"LSA","Team Member",{"$f":"'Reference Sizing'!$P$7","v":"Pega"},"Lead System Architect",1,1,{"$f":"IF(CoProdFlag, 0.6, 1)","v":0.6}]
[null,null,null,"Total Dev Team",{"$f":"SUBTOTAL(109,Table7[Total])-E2","v":4.5},{"$f":"IF(RoboticsOnlyClient=FALSE,NumScrumTeams&\" Scrum Team\"&IF(NumScrumTeams>1,\"s\",\"\")&\": \",\"\")&IFERROR(LEFT(F2&F3&F4&F5&F6,LEN(F2&F3&F4&F5&F6)-2),\"\"\"\")","v":"1 Scrum Team: 1 EL, 1 (L/S)BA, 1 LSA, 2 (S)SA, ½ UX/UI"},null,{"$f":"VLOOKUP(Table414[[#This Row],[CTB Name]],Table7[[Role]:[Total]],4,0)","v":2},"(S)SA","Team Member",{"$f":"'Reference Sizing'!$P$7","v":"Pega"},"(Sr) System Architect",1,1,1]
[null,null,null,"Total Dev incl. DSM",{"$f":"Table7[[#Totals],[Total]]+(DSM_OnlyClient*Table53[[#Totals],[Amt]])","v":4.5},null,null,{"$f":"ROUNDUP(VLOOKUP(Table414[[#This Row],[CTB Name]],Table7[[Role]:[Total]],4,0),0)","v":1},"UX/UI","Team Member",{"$f":"'Reference Sizing'!$P$7","v":"Pega"},"Experience Designer",{"$f":"VLOOKUP(Table414[[#This Row],[CTB Name]],Table7[[Role]:[Total]],4,0)","v":0.5},1,1]
{"$rows_left_out":26}
{"sheet":"ExportScrumSizing","index":14,"n_rows":35,"n_cols":14,"rows_kept":35,"cut":false,"hidden":true,"merged":[]}
["Client/Organization",{"$f":"IF(ClientName<>\"\",ClientName,\"\")","v":""}]
["Project",{"$f":"IF('Project Summary'!I5<>\"\",'Project Summary'!I5,\"\")","v":""}]
[]
["Area","Grouping"]
["AP ID"]
["AP Mode"]
["AP Label"]
[]
{"$rows_left_out":28}
{"sheet":"Dropdowns","index":15,"n_rows":24,"n_cols":38,"rows_kept":24,"cut":false,"hidden":true,"merged":[[0,30,0,31]]}
["Release",null,null,"LMH",null,null,"Priority",null,"Interfaces",null,"Complexity",null,null,"Interface Type",null,"Connector Type",null,"Service Type",null,"Select",null,"All",null,"App Maturity",null,null,"Methodology",null,"Channels",null,"Project Lead",null,null,"Pega Version",null,"Staffing Model",null,"Fibonacci"]
["<Select>",0,null,"<Select>",0,null,"<Select>",null,"<Select>",null,"<Select>",0,null,"<Select>",null,"<Select>",null,"<Select>",null,"<Select>",null,"All",null,"<Select>",0,null,"Agile/Scrum",null,0,null,"<Select>",null,null,"<Select>",null,"<Select>",null,1]
["MLP1",1,null,"Low",2,null,1,null,"Existing",1,"OOTB",1,null,"Connector",null,"Connect Adobe PDF",null,"Service Adobe PDF",null,null,null,null,null,"High Maturity Strategic App",1,null,"Waterfall/Other",null,0.25,null,"Co-Production","CoProdStaff",null,8.5,null,"Pega Led",null,2]
["MLP2",2,null,"Medium",3,null,2,null,"New",2,"Low",2,null,"Service",null,"Connect BPEL",null,"Service BPEL",null,null,null,null,null,"Medium Maturity Strategic App",2,null,null,null,0.5,null,"Non-Co-Production","PegaLedStaff",null,8.4,null,"Partner Led",null,{"$f":"AL3+AL2","v":3}]
["MLP3",3,null,"High",4,null,3,null,null,3,"Medium",3,null,null,null,"Connect CMIS",null,"Service COM",null,null,null,null,null,"Low Maturity Strategic App",3,null,null,null,0.75,null,null,null,null,"8.3",null,"<Select>",null,5]
["MLP4",4,null,null,null,null,4,null,null,4,"High",4,null,null,null,"Connect dotNet",null,"Service CORBA",null,null,null,null,null,"Mix of Strat App & Platform",4,null,null,null,1,null,null,null,null,"8.2",null,"Pega Led / Client Co-Prod",null,8]
["Future",5,null,null,null,null,5,null,null,5,"Complex",5,null,null,null,"Connect Directed Web Access",null,"Service dotNet",null,null,null,null,null,"100% Platform",5,null,null,null,null,null,null,null,null,"8.1",null,"Partner Led / Client Co-Prod",null,13]
[null,null,null,null,null,null,6,null,null,null,null,null,null,null,null,"Connect EJB",null,"Service EJB",null,null,null,null,null,null,null,null,null,null,null,null,null,null,null,"7.x",null,null,null,21]
{"$rows_left_out":17}
{"sheet":"Tabs","index":16,"n_rows":10,"n_cols":5,"rows_kept":10,"cut":false,"hidden":true,"merged":[]}
["Navigation Order","Modified","Tab Name",null,"Context Menu"]
[{"$f":"MID(CELL(\"filename\",'Project Summary'!$A$1),FIND(\"]\",CELL(\"filename\",'Project Summary'!$A$1))+1,25)","v":"Project Summary"},false,null,null,{"$f":"MID(CELL(\"filename\",Microjourneys!$A$1),FIND(\"]\",CELL(\"filename\",Microjourneys!$A$1))+1,25)","v":"Microjourneys"}]
[{"$f":"MID(CELL(\"filename\",Interfaces!$A$1),FIND(\"]\",CELL(\"filename\",Interfaces!$A$1))+1,25)","v":"Interfaces"},false,{"$f":"IF(B3, MID(A3,4,100) & \", \",\"\")","v":""},null,{"$f":"MID(CELL(\"filename\",'Case Types'!$A$1),FIND(\"]\",CELL(\"filename\",'Case Types'!$A$1))+1,25)","v":"Case Types"}]
[{"$f":"MID(CELL(\"filename\",Personas!$A$1),FIND(\"]\",CELL(\"filename\",Personas!$A$1))+1,25)","v":"Personas"},false,"",null,{"$f":"MID(CELL(\"filename\",'Supporting Features'!$A$1),FIND(\"]\",CELL(\"filename\",'Supporting Features'!$A$1))+1,25)","v":"Supporting Features"}]
[{"$f":"MID(CELL(\"filename\",'Case Types'!$A$1),FIND(\"]\",CELL(\"filename\",'Case Types'!$A$1))+1,25)","v":"Case Types"},false,"",null,{"$f":"MID(CELL(\"filename\",Interfaces!$A$1),FIND(\"]\",CELL(\"filename\",Interfaces!$A$1))+1,25)","v":"Interfaces"}]
[{"$f":"MID(CELL(\"filename\",'Supporting Features'!$A$1),FIND(\"]\",CELL(\"filename\",'Supporting Features'!$A$1))+1,25)","v":"Supporting Features"},false,"",null,{"$f":"MID(CELL(\"filename\",Personas!$A$1),FIND(\"]\",CELL(\"filename\",Personas!$A$1))+1,25)","v":"Personas"}]
[{"$f":"MID(CELL(\"filename\",Reports!$A$1),FIND(\"]\",CELL(\"filename\",Reports!$A$1))+1,25)","v":"Reports"},false,"",null,{"$f":"MID(CELL(\"filename\",Reports!$A$1),FIND(\"]\",CELL(\"filename\",Reports!$A$1))+1,25)","v":"Reports"}]
[{"$f":"MID(CELL(\"filename\",'Project Attributes'!$A$1),FIND(\"]\",CELL(\"filename\",'Project Attributes'!$A$1))+1,25)","v":"Project Attributes"},false,""]
{"$rows_left_out":2}